{"text_format":"1","workbook":"xlsx","n_sheets":4,"sheets":["台帳","長形3号窓明","長形3号横","角形2号横"],"not_rendered":{"charts":0,"images":0,"macros":1,"external_links":0,"defined_names":3,"comments":1,"pivot_tables":0},"unopened":[],"bounds":{"document_bytes":16777216,"sheet_cells":100000,"rows_first":2000,"rows_last":500,"rows_between":2000,"halvings":0,"cell_chars":16384,"cell_head_chars":4096},"cells_cut":0,"cells_raw":0,"read":"whole","date_system":"1900"}

{"sheet":"台帳","index":0,"n_rows":501,"n_cols":7,"rows_kept":501,"cut":false,"hidden":false,"merged":[]}
["送付先台帳"]
["No.","氏名","郵便番号","都道府県","住所","マンション、アパート等","備考"]
[1,"○○　○○","1112222",null,"○○市○○町○○〇ー〇","○○ビル4F"]
[2,"△△　△△","1234567",null,"△△市△△町△△△ー△"]
[3,"□□　□□","3334444",null,"□□市□□町□□□ー□","サンライズ203号"]
[]
[]
[]
[]
[]
[]
[]
[]
[]
[]
[]
[]
[]
[]
[]
[]
[]
[]
[]
[]
[]
[]
[]
[]
[]
[]
[]
[]
[]
[]
[]
[]
[]
[]
[]
[]
[]
[]
[]
[]
[]
[]
[]
[]
[]
[]
[]
[]
[]
[]
[]
[]
[]
[]
[]
[]
[]
[]
[]
[]
[]
[]
[]
[]
[]
[null,null,null,null,{"$f":"IF(C71=\"\",\"\",IFERROR(VLOOKUP(C71,#REF!,3,0)&VLOOKUP(C71,#REF!,4,0),VLOOKUP(TEXT(C71,\"@\"),#REF!,3,0)&VLOOKUP(TEXT(C71,\"@\"),#REF!,4,0)))","v":""}]
[null,null,null,null,{"$f":"IF(C72=\"\",\"\",IFERROR(VLOOKUP(C72,#REF!,3,0)&VLOOKUP(C72,#REF!,4,0),VLOOKUP(TEXT(C72,\"@\"),#REF!,3,0)&VLOOKUP(TEXT(C72,\"@\"),#REF!,4,0)))","v":""}]
[null,null,null,null,{"$f":"IF(C73=\"\",\"\",IFERROR(VLOOKUP(C73,#REF!,3,0)&VLOOKUP(C73,#REF!,4,0),VLOOKUP(TEXT(C73,\"@\"),#REF!,3,0)&VLOOKUP(TEXT(C73,\"@\"),#REF!,4,0)))","v":""}]
[null,null,null,null,{"$f":"IF(C74=\"\",\"\",IFERROR(VLOOKUP(C74,#REF!,3,0)&VLOOKUP(C74,#REF!,4,0),VLOOKUP(TEXT(C74,\"@\"),#REF!,3,0)&VLOOKUP(TEXT(C74,\"@\"),#REF!,4,0)))","v":""}]
[null,null,null,null,{"$f":"IF(C75=\"\",\"\",IFERROR(VLOOKUP(C75,#REF!,3,0)&VLOOKUP(C75,#REF!,4,0),VLOOKUP(TEXT(C75,\"@\"),#REF!,3,0)&VLOOKUP(TEXT(C75,\"@\"),#REF!,4,0)))","v":""}]
[null,null,null,null,{"$f":"IF(C76=\"\",\"\",IFERROR(VLOOKUP(C76,#REF!,3,0)&VLOOKUP(C76,#REF!,4,0),VLOOKUP(TEXT(C76,\"@\"),#REF!,3,0)&VLOOKUP(TEXT(C76,\"@\"),#REF!,4,0)))","v":""}]
[null,null,null,null,{"$f":"IF(C77=\"\",\"\",IFERROR(VLOOKUP(C77,#REF!,3,0)&VLOOKUP(C77,#REF!,4,0),VLOOKUP(TEXT(C77,\"@\"),#REF!,3,0)&VLOOKUP(TEXT(C77,\"@\"),#REF!,4,0)))","v":""}]
[null,null,null,null,{"$f":"IF(C78=\"\",\"\",IFERROR(VLOOKUP(C78,#REF!,3,0)&VLOOKUP(C78,#REF!,4,0),VLOOKUP(TEXT(C78,\"@\"),#REF!,3,0)&VLOOKUP(TEXT(C78,\"@\"),#REF!,4,0)))","v":""}]
[null,null,null,null,{"$f":"IF(C79=\"\",\"\",IFERROR(VLOOKUP(C79,#REF!,3,0)&VLOOKUP(C79,#REF!,4,0),VLOOKUP(TEXT(C79,\"@\"),#REF!,3,0)&VLOOKUP(TEXT(C79,\"@\"),#REF!,4,0)))","v":""}]
[null,null,null,null,{"$f":"IF(C80=\"\",\"\",IFERROR(VLOOKUP(C80,#REF!,3,0)&VLOOKUP(C80,#REF!,4,0),VLOOKUP(TEXT(C80,\"@\"),#REF!,3,0)&VLOOKUP(TEXT(C80,\"@\"),#REF!,4,0)))","v":""}]
[null,null,null,null,{"$f":"IF(C81=\"\",\"\",IFERROR(VLOOKUP(C81,#REF!,3,0)&VLOOKUP(C81,#REF!,4,0),VLOOKUP(TEXT(C81,\"@\"),#REF!,3,0)&VLOOKUP(TEXT(C81,\"@\"),#REF!,4,0)))","v":""}]
[null,null,null,null,{"$f":"IF(C82=\"\",\"\",IFERROR(VLOOKUP(C82,#REF!,3,0)&VLOOKUP(C82,#REF!,4,0),VLOOKUP(TEXT(C82,\"@\"),#REF!,3,0)&VLOOKUP(TEXT(C82,\"@\"),#REF!,4,0)))","v":""}]
[null,null,null,null,{"$f":"IF(C83=\"\",\"\",IFERROR(VLOOKUP(C83,#REF!,3,0)&VLOOKUP(C83,#REF!,4,0),VLOOKUP(TEXT(C83,\"@\"),#REF!,3,0)&VLOOKUP(TEXT(C83,\"@\"),#REF!,4,0)))","v":""}]
[null,null,null,null,{"$f":"IF(C84=\"\",\"\",IFERROR(VLOOKUP(C84,#REF!,3,0)&VLOOKUP(C84,#REF!,4,0),VLOOKUP(TEXT(C84,\"@\"),#REF!,3,0)&VLOOKUP(TEXT(C84,\"@\"),#REF!,4,0)))","v":""}]
[null,null,null,null,{"$f":"IF(C85=\"\",\"\",IFERROR(VLOOKUP(C85,#REF!,3,0)&VLOOKUP(C85,#REF!,4,0),VLOOKUP(TEXT(C85,\"@\"),#REF!,3,0)&VLOOKUP(TEXT(C85,\"@\"),#REF!,4,0)))","v":""}]
[null,null,null,null,{"$f":"IF(C86=\"\",\"\",IFERROR(VLOOKUP(C86,#REF!,3,0)&VLOOKUP(C86,#REF!,4,0),VLOOKUP(TEXT(C86,\"@\"),#REF!,3,0)&VLOOKUP(TEXT(C86,\"@\"),#REF!,4,0)))","v":""}]
[null,null,null,null,{"$f":"IF(C87=\"\",\"\",IFERROR(VLOOKUP(C87,#REF!,3,0)&VLOOKUP(C87,#REF!,4,0),VLOOKUP(TEXT(C87,\"@\"),#REF!,3,0)&VLOOKUP(TEXT(C87,\"@\"),#REF!,4,0)))","v":""}]
[null,null,null,null,{"$f":"IF(C88=\"\",\"\",IFERROR(VLOOKUP(C88,#REF!,3,0)&VLOOKUP(C88,#REF!,4,0),VLOOKUP(TEXT(C88,\"@\"),#REF!,3,0)&VLOOKUP(TEXT(C88,\"@\"),#REF!,4,0)))","v":""}]
[null,null,null,null,{"$f":"IF(C89=\"\",\"\",IFERROR(VLOOKUP(C89,#REF!,3,0)&VLOOKUP(C89,#REF!,4,0),VLOOKUP(TEXT(C89,\"@\"),#REF!,3,0)&VLOOKUP(TEXT(C89,\"@\"),#REF!,4,0)))","v":""}]
[null,null,null,null,{"$f":"IF(C90=\"\",\"\",IFERROR(VLOOKUP(C90,#REF!,3,0)&VLOOKUP(C90,#REF!,4,0),VLOOKUP(TEXT(C90,\"@\"),#REF!,3,0)&VLOOKUP(TEXT(C90,\"@\"),#REF!,4,0)))","v":""}]
[null,null,null,null,{"$f":"IF(C91=\"\",\"\",IFERROR(VLOOKUP(C91,#REF!,3,0)&VLOOKUP(C91,#REF!,4,0),VLOOKUP(TEXT(C91,\"@\"),#REF!,3,0)&VLOOKUP(TEXT(C91,\"@\"),#REF!,4,0)))","v":""}]
[null,null,null,null,{"$f":"IF(C92=\"\",\"\",IFERROR(VLOOKUP(C92,#REF!,3,0)&VLOOKUP(C92,#REF!,4,0),VLOOKUP(TEXT(C92,\"@\"),#REF!,3,0)&VLOOKUP(TEXT(C92,\"@\"),#REF!,4,0)))","v":""}]
[null,null,null,null,{"$f":"IF(C93=\"\",\"\",IFERROR(VLOOKUP(C93,#REF!,3,0)&VLOOKUP(C93,#REF!,4,0),VLOOKUP(TEXT(C93,\"@\"),#REF!,3,0)&VLOOKUP(TEXT(C93,\"@\"),#REF!,4,0)))","v":""}]
[null,null,null,null,{"$f":"IF(C94=\"\",\"\",IFERROR(VLOOKUP(C94,#REF!,3,0)&VLOOKUP(C94,#REF!,4,0),VLOOKUP(TEXT(C94,\"@\"),#REF!,3,0)&VLOOKUP(TEXT(C94,\"@\"),#REF!,4,0)))","v":""}]
[null,null,null,null,{"$f":"IF(C95=\"\",\"\",IFERROR(VLOOKUP(C95,#REF!,3,0)&VLOOKUP(C95,#REF!,4,0),VLOOKUP(TEXT(C95,\"@\"),#REF!,3,0)&VLOOKUP(TEXT(C95,\"@\"),#REF!,4,0)))","v":""}]
[null,null,null,null,{"$f":"IF(C96=\"\",\"\",IFERROR(VLOOKUP(C96,#REF!,3,0)&VLOOKUP(C96,#REF!,4,0),VLOOKUP(TEXT(C96,\"@\"),#REF!,3,0)&VLOOKUP(TEXT(C96,\"@\"),#REF!,4,0)))","v":""}]
[null,null,null,null,{"$f":"IF(C97=\"\",\"\",IFERROR(VLOOKUP(C97,#REF!,3,0)&VLOOKUP(C97,#REF!,4,0),VLOOKUP(TEXT(C97,\"@\"),#REF!,3,0)&VLOOKUP(TEXT(C97,\"@\"),#REF!,4,0)))","v":""}]
[null,null,null,null,{"$f":"IF(C98=\"\",\"\",IFERROR(VLOOKUP(C98,#REF!,3,0)&VLOOKUP(C98,#REF!,4,0),VLOOKUP(TEXT(C98,\"@\"),#REF!,3,0)&VLOOKUP(TEXT(C98,\"@\"),#REF!,4,0)))","v":""}]
[null,null,null,null,{"$f":"IF(C99=\"\",\"\",IFERROR(VLOOKUP(C99,#REF!,3,0)&VLOOKUP(C99,#REF!,4,0),VLOOKUP(TEXT(C99,\"@\"),#REF!,3,0)&VLOOKUP(TEXT(C99,\"@\"),#REF!,4,0)))","v":""}]
[null,null,null,null,{"$f":"IF(C100=\"\",\"\",IFERROR(VLOOKUP(C100,#REF!,3,0)&VLOOKUP(C100,#REF!,4,0),VLOOKUP(TEXT(C100,\"@\"),#REF!,3,0)&VLOOKUP(TEXT(C100,\"@\"),#REF!,4,0)))","v":""}]
[null,null,null,null,{"$f":"IF(C101=\"\",\"\",IFERROR(VLOOKUP(C101,#REF!,3,0)&VLOOKUP(C101,#REF!,4,0),VLOOKUP(TEXT(C101,\"@\"),#REF!,3,0)&VLOOKUP(TEXT(C101,\"@\"),#REF!,4,0)))","v":""}]
[null,null,null,null,{"$f":"IF(C102=\"\",\"\",IFERROR(VLOOKUP(C102,#REF!,3,0)&VLOOKUP(C102,#REF!,4,0),VLOOKUP(TEXT(C102,\"@\"),#REF!,3,0)&VLOOKUP(TEXT(C102,\"@\"),#REF!,4,0)))","v":""}]
[null,null,null,null,{"$f":"IF(C103=\"\",\"\",IFERROR(VLOOKUP(C103,#REF!,3,0)&VLOOKUP(C103,#REF!,4,0),VLOOKUP(TEXT(C103,\"@\"),#REF!,3,0)&VLOOKUP(TEXT(C103,\"@\"),#REF!,4,0)))","v":""}]
[null,null,null,null,{"$f":"IF(C104=\"\",\"\",IFERROR(VLOOKUP(C104,#REF!,3,0)&VLOOKUP(C104,#REF!,4,0),VLOOKUP(TEXT(C104,\"@\"),#REF!,3,0)&VLOOKUP(TEXT(C104,\"@\"),#REF!,4,0)))","v":""}]
[null,null,null,null,{"$f":"IF(C105=\"\",\"\",IFERROR(VLOOKUP(C105,#REF!,3,0)&VLOOKUP(C105,#REF!,4,0),VLOOKUP(TEXT(C105,\"@\"),#REF!,3,0)&VLOOKUP(TEXT(C105,\"@\"),#REF!,4,0)))","v":""}]
[null,null,null,null,{"$f":"IF(C106=\"\",\"\",IFERROR(VLOOKUP(C106,#REF!,3,0)&VLOOKUP(C106,#REF!,4,0),VLOOKUP(TEXT(C106,\"@\"),#REF!,3,0)&VLOOKUP(TEXT(C106,\"@\"),#REF!,4,0)))","v":""}]
[null,null,null,null,{"$f":"IF(C107=\"\",\"\",IFERROR(VLOOKUP(C107,#REF!,3,0)&VLOOKUP(C107,#REF!,4,0),VLOOKUP(TEXT(C107,\"@\"),#REF!,3,0)&VLOOKUP(TEXT(C107,\"@\"),#REF!,4,0)))","v":""}]
[null,null,null,null,{"$f":"IF(C108=\"\",\"\",IFERROR(VLOOKUP(C108,#REF!,3,0)&VLOOKUP(C108,#REF!,4,0),VLOOKUP(TEXT(C108,\"@\"),#REF!,3,0)&VLOOKUP(TEXT(C108,\"@\"),#REF!,4,0)))","v":""}]
[null,null,null,null,{"$f":"IF(C109=\"\",\"\",IFERROR(VLOOKUP(C109,#REF!,3,0)&VLOOKUP(C109,#REF!,4,0),VLOOKUP(TEXT(C109,\"@\"),#REF!,3,0)&VLOOKUP(TEXT(C109,\"@\"),#REF!,4,0)))","v":""}]
[null,null,null,null,{"$f":"IF(C110=\"\",\"\",IFERROR(VLOOKUP(C110,#REF!,3,0)&VLOOKUP(C110,#REF!,4,0),VLOOKUP(TEXT(C110,\"@\"),#REF!,3,0)&VLOOKUP(TEXT(C110,\"@\"),#REF!,4,0)))","v":""}]
[null,null,null,null,{"$f":"IF(C111=\"\",\"\",IFERROR(VLOOKUP(C111,#REF!,3,0)&VLOOKUP(C111,#REF!,4,0),VLOOKUP(TEXT(C111,\"@\"),#REF!,3,0)&VLOOKUP(TEXT(C111,\"@\"),#REF!,4,0)))","v":""}]
[null,null,null,null,{"$f":"IF(C112=\"\",\"\",IFERROR(VLOOKUP(C112,#REF!,3,0)&VLOOKUP(C112,#REF!,4,0),VLOOKUP(TEXT(C112,\"@\"),#REF!,3,0)&VLOOKUP(TEXT(C112,\"@\"),#REF!,4,0)))","v":""}]
[null,null,null,null,{"$f":"IF(C113=\"\",\"\",IFERROR(VLOOKUP(C113,#REF!,3,0)&VLOOKUP(C113,#REF!,4,0),VLOOKUP(TEXT(C113,\"@\"),#REF!,3,0)&VLOOKUP(TEXT(C113,\"@\"),#REF!,4,0)))","v":""}]
[null,null,null,null,{"$f":"IF(C114=\"\",\"\",IFERROR(VLOOKUP(C114,#REF!,3,0)&VLOOKUP(C114,#REF!,4,0),VLOOKUP(TEXT(C114,\"@\"),#REF!,3,0)&VLOOKUP(TEXT(C114,\"@\"),#REF!,4,0)))","v":""}]
[null,null,null,null,{"$f":"IF(C115=\"\",\"\",IFERROR(VLOOKUP(C115,#REF!,3,0)&VLOOKUP(C115,#REF!,4,0),VLOOKUP(TEXT(C115,\"@\"),#REF!,3,0)&VLOOKUP(TEXT(C115,\"@\"),#REF!,4,0)))","v":""}]
[null,null,null,null,{"$f":"IF(C116=\"\",\"\",IFERROR(VLOOKUP(C116,#REF!,3,0)&VLOOKUP(C116,#REF!,4,0),VLOOKUP(TEXT(C116,\"@\"),#REF!,3,0)&VLOOKUP(TEXT(C116,\"@\"),#REF!,4,0)))","v":""}]
[null,null,null,null,{"$f":"IF(C117=\"\",\"\",IFERROR(VLOOKUP(C117,#REF!,3,0)&VLOOKUP(C117,#REF!,4,0),VLOOKUP(TEXT(C117,\"@\"),#REF!,3,0)&VLOOKUP(TEXT(C117,\"@\"),#REF!,4,0)))","v":""}]
[null,null,null,null,{"$f":"IF(C118=\"\",\"\",IFERROR(VLOOKUP(C118,#REF!,3,0)&VLOOKUP(C118,#REF!,4,0),VLOOKUP(TEXT(C118,\"@\"),#REF!,3,0)&VLOOKUP(TEXT(C118,\"@\"),#REF!,4,0)))","v":""}]
[null,null,null,null,{"$f":"IF(C119=\"\",\"\",IFERROR(VLOOKUP(C119,#REF!,3,0)&VLOOKUP(C119,#REF!,4,0),VLOOKUP(TEXT(C119,\"@\"),#REF!,3,0)&VLOOKUP(TEXT(C119,\"@\"),#REF!,4,0)))","v":""}]
[null,null,null,null,{"$f":"IF(C120=\"\",\"\",IFERROR(VLOOKUP(C120,#REF!,3,0)&VLOOKUP(C120,#REF!,4,0),VLOOKUP(TEXT(C120,\"@\"),#REF!,3,0)&VLOOKUP(TEXT(C120,\"@\"),#REF!,4,0)))","v":""}]
{"$rows_left_out":382}
{"sheet":"長形3号窓明","index":1,"n_rows":19,"n_cols":31,"rows_kept":19,"cut":false,"hidden":false,"merged":[]}
[{"$f":"IFERROR(IF(AD1=\"\",\"\",\"〒\"&LEFT(VLOOKUP(AD1,台帳!A:C,3,0),3)&\"-\"&MID(VLOOKUP(AD1,台帳!A:C,3,0),4,4)),\"\")","v":"〒123-4567"},null,null,null,null,null,null,null,null,null,null,null,null,null,null,null,null,null,null,null,null,null,null,null,null,null,null,null,null,2,"←表示番号"]
[{"$f":"IFERROR(IF(AD1=\"\",\"\",VLOOKUP(AD1,台帳!A:E,5,0)),\"\")","v":"△△市△△町△△△ー△"},null,null,null,null,null,null,null,null,null,null,null,null,null,null,null,null,null,null,null,null,null,null,null,null,null,null,null,null,1,"←連続印刷開始番号"]
[{"$f":"IFERROR(IF(AD1=\"\",\"\",IF(VLOOKUP(AD1,台帳!A:F,6,0)=\"\",\"\",VLOOKUP(AD1,台帳!A:F,6,0))),\"\")","v":""},null,null,null,null,null,null,null,null,null,null,null,null,null,null,null,null,null,null,null,null,null,null,null,null,null,null,null,null,3,"←連続印刷終了番号"]
[{"$f":"IFERROR(IF(AD1=\"\",\"\",VLOOKUP(AD1,台帳!A:B,2,0)&\"　様\"),\"\")","v":"△△　△△　様"}]
[]
[]
[]
[]
[null,null,null,null,null,null,null,"（ここからタイトルと本文を記入）"]
[null,null,null,null,null,null,null,null,null,null,null,null,null,null,null,null,null,null,null,null,null,null,null,null,null,null,null,null,null,"使い方"]
[null,null,null,null,null,null,null,null,null,null,null,null,null,null,null,null,null,null,null,null,null,null,null,null,null,null,null,null,null,"印刷した用紙を３つ折りにし、長形3号窓明封筒に入れると宛先が窓から見えるようになっています。"]
[null,null,null,null,null,null,null,null,null,null,null,null,null,null,null,null,null,null,null,null,null,null,null,null,null,null,null,null,null,null,"用紙サイズ：A4"]
[null,null,null,null,null,null,null,null,null,null,null,null,null,null,null,null,null,null,null,null,null,null,null,null,null,null,null,null,null,null,"封筒の型式：長形3号窓明"]
[null,null,null,null,null,null,null,null,null,null,null,null,null,null,null,null,null,null,null,null,null,null,null,null,null,null,null,null,null,"AD1セルに台帳シートのA列の数字を入れると、その行の宛先が表示されます。"]
[null,null,null,null,null,null,null,null,null,null,null,null,null,null,null,null,null,null,null,null,null,null,null,null,null,null,null,null,null,"連続で印刷したい場合はAD2セルに印刷開始行、AD3セルに印刷終了行を入力し、連続プレビューボタンを"]
[null,null,null,null,null,null,null,null,null,null,null,null,null,null,null,null,null,null,null,null,null,null,null,null,null,null,null,null,null,"押すと印刷内容が確認できます。"]
[null,null,null,null,null,null,null,null,null,null,null,null,null,null,null,null,null,null,null,null,null,null,null,null,null,null,null,null,null,"※プレビュー表示中に”印刷プレビューを閉じる”を押すと次のページが表示されます。"]
[null,null,null,null,null,null,null,null,null,null,null,null,null,null,null,null,null,null,null,null,null,null,null,null,null,null,null,null,null,"　中断する場合はEscキーを押してください。"]
[null,null,null,null,null,null,null,null,null,null,null,null,null,null,null,null,null,null,null,null,null,null,null,null,null,null,null,null,null,"問題なければ連続印刷ボタンを押して実行してください。"]

{"sheet":"長形3号横","index":2,"n_rows":21,"n_cols":30,"rows_kept":21,"cut":false,"hidden":false,"merged":[[9,0,9,14]]}
[null,null,{"$f":"IFERROR(IF(Q2=\"\",\"\",LEFT(VLOOKUP(Q2,台帳!A:C,3,0),1)),\"\")","v":"3"},null,{"$f":"IFERROR(IF(Q2=\"\",\"\",MID(VLOOKUP(Q2,台帳!A:C,3,0),2,1)),\"\")","v":"3"},null,{"$f":"IFERROR(IF(Q2=\"\",\"\",MID(VLOOKUP(Q2,台帳!A:C,3,0),3,1)),\"\")","v":"3"},null,{"$f":"IFERROR(IF(Q2=\"\",\"\",MID(VLOOKUP(Q2,台帳!A:C,3,0),4,1)),\"\")","v":"4"},null,{"$f":"IFERROR(IF(Q2=\"\",\"\",MID(VLOOKUP(Q2,台帳!A:C,3,0),5,1)),\"\")","v":"4"},null,{"$f":"IFERROR(IF(Q2=\"\",\"\",MID(VLOOKUP(Q2,台帳!A:C,3,0),6,1)),\"\")","v":"4"},null,{"$f":"IFERROR(IF(Q2=\"\",\"\",MID(VLOOKUP(Q2,台帳!A:C,3,0),7,1)),\"\")","v":"4"},null,null,null,null,null,null,null,null,null,null,null,null,null,null,0]
[null,null,null,null,null,null,null,null,null,null,null,null,null,null,null,null,3,"←表示番号"]
[null,null,null,null,null,null,null,null,null,null,null,null,null,null,null,null,1,"←連続印刷開始番号"]
[null,null,null,null,null,null,null,null,null,null,null,null,null,null,null,null,3,"←連続印刷終了番号"]
[null,null,null,null,null,null,null,null,{"$f":"IFERROR(IF(VLOOKUP(Q2,台帳!A:F,7,0)=\"\",\"\",VLOOKUP(Q2,台帳!A:F,7,0)),\"\")","v":""}]
[]
[]
[]
[]
[{"$f":"\"　\"&IFERROR(IF(Q2=\"\",\"\",VLOOKUP(Q2,台帳!A:D,4,0)&VLOOKUP(Q2,台帳!A:E,5,0)),\"\")","v":"　□□市□□町□□□ー□"}]
[null,{"$f":"\"　　\"&IFERROR(IF(Q2=\"\",\"\",VLOOKUP(Q2,台帳!A:D,4,0)&VLOOKUP(Q2,台帳!A:F,6,0)),\"\")","v":"　　サンライズ203号"}]
[]
[null,{"$f":"IFERROR(IF(VLOOKUP(Q2,台帳!A:B,2,0)=\"\",\"\",VLOOKUP(Q2,台帳!A:B,2,0))&\"　様\",\"\")","v":"□□　□□　様"},null,null,null,null,null,null,null,null,null,null,null,null,null,null,"使い方"]
[null,null,null,null,null,null,null,null,null,null,null,null,null,null,null,null,"長形3号封筒の宛名面に直接宛名を印刷します。"]
[null,null,null,null,null,null,null,null,null,null,null,null,null,null,null,null,"プリンタの設定で用紙サイズを長形3号封筒に設定してください。"]
[null,null,null,null,null,null,null,null,null,null,null,null,null,null,null,null,"Q2セルに台帳シートのA列の数字を入れると、その行の宛先が表示されます。"]
[null,null,null,null,null,null,null,null,null,null,null,null,null,null,null,null,"連続で印刷したい場合はQ3セルに印刷開始行、Q4セルに印刷終了行を入力し、連続プレビューボタンを"]
[null,null,null,null,null,null,null,null,null,null,null,null,null,null,null,null,"押すと印刷内容が確認できます。"]
[null,null,null,null,null,null,null,null,null,null,null,null,null,null,null,null,"※プレビュー表示中に”印刷プレビューを閉じる”を押すと次のページが表示されます。"]
[null,null,null,null,null,null,null,null,null,null,null,null,null,null,null,null,"　中断する場合はEscキーを押してください。"]
[null,null,null,null,null,null,null,null,null,null,null,null,null,null,null,null,"問題なければプリンターに封筒をセットし、連続印刷ボタンを押して実行してください。"]

{"sheet":"角形2号横","index":3,"n_rows":21,"n_cols":30,"rows_kept":21,"cut":false,"hidden":false,"merged":[[9,0,9,14]]}
[null,null,{"$f":"IFERROR(IF(Q2=\"\",\"\",LEFT(VLOOKUP(Q2,台帳!A:C,3,0),1)),\"\")","v":"3"},null,{"$f":"IFERROR(IF(Q2=\"\",\"\",MID(VLOOKUP(Q2,台帳!A:C,3,0),2,1)),\"\")","v":"3"},null,{"$f":"IFERROR(IF(Q2=\"\",\"\",MID(VLOOKUP(Q2,台帳!A:C,3,0),3,1)),\"\")","v":"3"},null,{"$f":"IFERROR(IF(Q2=\"\",\"\",MID(VLOOKUP(Q2,台帳!A:C,3,0),4,1)),\"\")","v":"4"},null,{"$f":"IFERROR(IF(Q2=\"\",\"\",MID(VLOOKUP(Q2,台帳!A:C,3,0),5,1)),\"\")","v":"4"},null,{"$f":"IFERROR(IF(Q2=\"\",\"\",MID(VLOOKUP(Q2,台帳!A:C,3,0),6,1)),\"\")","v":"4"},null,{"$f":"IFERROR(IF(Q2=\"\",\"\",MID(VLOOKUP(Q2,台帳!A:C,3,0),7,1)),\"\")","v":"4"},null,null,null,null,null,null,null,null,null,null,null,null,null,null,0]
[null,null,null,null,null,null,null,null,null,null,null,null,null,null,null,null,3,"←表示番号"]
[null,null,null,null,null,null,null,null,null,null,null,null,null,null,null,null,1,"←連続印刷開始番号"]
[null,null,null,null,null,null,null,null,null,null,null,null,null,null,null,null,3,"←連続印刷終了番号"]
[null,null,null,null,null,null,null,null,{"$f":"IFERROR(IF(VLOOKUP(Q2,台帳!A:F,7,0)=\"\",\"\",VLOOKUP(Q2,台帳!A:F,7,0)),\"\")","v":""}]
[]
[]
[]
[]
[{"$f":"\"　　　　　　\"&IFERROR(IF(Q2=\"\",\"\",VLOOKUP(Q2,台帳!A:D,4,0)&VLOOKUP(Q2,台帳!A:E,5,0)),\"\")","v":"　　　　　　□□市□□町□□□ー□"}]
[null,{"$f":"\"　　　\"&IFERROR(IF(Q2=\"\",\"\",VLOOKUP(Q2,台帳!A:F,6,0)),\"\")","v":"　　　サンライズ203号"}]
[]
[null,{"$f":"IFERROR(IF(VLOOKUP(Q2,台帳!A:B,2,0)=\"\",\"\",VLOOKUP(Q2,台帳!A:B,2,0))&\"　様\",\"\")","v":"□□　□□　様"},null,null,null,null,null,null,null,null,null,null,null,null,null,null,"使い方"]
[null,null,null,null,null,null,null,null,null,null,null,null,null,null,null,null,"角形2号封筒の宛名面に直接宛名を印刷します。"]
[null,null,null,null,null,null,null,null,null,null,null,null,null,null,null,null,"プリンタの設定で用紙サイズを角形２号封筒に設定してください。"]
[null,null,null,null,null,null,null,null,null,null,null,null,null,null,null,null,"Q2セルに台帳シートのA列の数字を入れると、その行の宛先が表示されます。"]
[null,null,null,null,null,null,null,null,null,null,null,null,null,null,null,null,"連続で印刷したい場合はQ3セルに印刷開始行、Q4セルに印刷終了行を入力し、連続プレビューボタンを"]
[null,null,null,null,null,null,null,null,null,null,null,null,null,null,null,null,"押すと印刷内容が確認できます。"]
[null,null,null,null,null,null,null,null,null,null,null,null,null,null,null,null,"※プレビュー表示中に”印刷プレビューを閉じる”を押すと次のページが表示されます。"]
[null,null,null,null,null,null,null,null,null,null,null,null,null,null,null,null,"　中断する場合はEscキーを押してください。"]
[null,null,null,null,null,null,null,null,null,null,null,null,null,null,null,null,"問題なければプリンターに封筒をセットし、連続印刷ボタンを押して実行してください。"]